{"text_format":"1","workbook":"xlsx","n_sheets":13,"sheets":["General Information","Instructions","IE24 BUDGET tool","F2_ARC Contributions","F3_Non-ARC Contributions","UQ Research Academic Staff","UQ Professional Staff","Salary Gap Calculations","List","Lists","Salary Gap Calculations (2)","Admin-Salaries","Admin-Other"],"not_rendered":{"charts":0,"images":10,"macros":1,"external_links":2,"defined_names":70,"comments":2,"pivot_tables":0},"unopened":[],"bounds":{"document_bytes":16777216,"sheet_cells":100000,"rows_first":2000,"rows_last":500,"rows_between":2000,"halvings":0,"cell_chars":16384,"cell_head_chars":4096},"cells_cut":0,"cells_raw":0,"read":"whole","date_system":"1900"}

{"sheet":"General Information","index":0,"n_rows":1,"n_cols":16,"rows_kept":1,"cut":false,"hidden":false,"merged":[]}
[null,null,null,null,null,null,null,null,null,null,null,null,null,null,"Version 3","2023-09-06"]

{"sheet":"Instructions","index":1,"n_rows":186,"n_cols":14,"rows_kept":186,"cut":false,"hidden":false,"merged":[[181,13,181,18],[182,13,182,18],[177,13,177,18],[178,13,178,18],[179,13,179,18],[180,13,180,18],[130,13,130,18],[131,13,131,18],[132,13,132,18],[133,13,133,18],[134,13,134,18],[81,13,81,18],[75,13,75,18],[128,13,128,18],[129,13,129,18],[80,13,80,18],[5,13,5,18],[74,13,74,18],[135,13,135,18],[183,13,183,18],[10,13,10,18],[7,13,7,18],[6,13,6,18],[8,13,8,18],[9,13,9,18],[11,13,11,18],[76,13,76,18],[77,13,77,18],[78,13,78,18],[79,13,79,18],[12,13,12,18],[176,13,176,18]]}
["1. Selection of Fellowship Duration and autopopulation of UQ Earmarked HDR Scholarship"]
["The main tab for data entry is the IE24 BUDGET tool. To start the data entry process, select the duration of your fellowship in cell C5."]
["Based on the duration selected, the calculation will autopopulate with UQ Earmarked PhD Scholarship contributions (only 3 year fellowships will be eligible to receive a UQ PhD Scholarship)."]
[]
[null,null,null,null,null,null,null,null,null,null,null,null,null,"NAVIGATION:"]
[null,null,null,null,null,null,null,null,null,null,null,null,null,{"$f":"A1","v":"1. Selection of Fellowship Duration and autopopulation of UQ Earmarked HDR Scholarship"}]
[null,null,null,null,null,null,null,null,null,null,null,null,null,{"$f":"A21","v":"2. Selection of Salary Level and Contribution Amounts"}]
[null,null,null,null,null,null,null,null,null,null,null,null,null,{"$f":"A44","v":"3. Expenditure Data Entry"}]
[null,null,null,null,null,null,null,null,null,null,null,null,null,{"$f":"A68","v":"4. Fellow's Salary Level Check"}]
[null,null,null,null,null,null,null,null,null,null,null,null,null,{"$f":"A92","v":"5. Budget Check"}]
[null,null,null,null,null,null,null,null,null,null,null,null,null,{"$f":"A110","v":"6. F2 and F3 - Budget Justification"}]
[null,null,null,null,null,null,null,null,null,null,null,null,null,{"$f":"A143","v":"7. Export into the Application"}]
[null,null,null,null,null,null,null,null,null,null,null,null,null,{"$f":"A173","v":"8. Troubleshooting and Additional Resources"}]
[]
[]
{"$rows_left_out":172}
{"sheet":"IE24 BUDGET tool","index":2,"n_rows":139,"n_cols":28,"rows_kept":139,"cut":false,"hidden":false,"merged":[[1,18,1,25],[0,4,0,7],[0,8,0,9],[0,10,0,11],[2,0,41,0],[4,3,4,11],[0,0,1,1],[96,4,96,11],[98,3,98,11],[2,18,2,25],[7,18,7,25],[12,18,12,25],[2,4,2,11],[47,4,47,7],[47,8,47,9],[47,10,47,11],[49,4,49,11],[51,3,51,11],[94,4,94,7],[94,8,94,9],[94,10,94,11],[138,0,138,2],[47,0,48,1],[94,0,95,1],[6,2,41,2],[53,2,88,2],[100,2,135,2],[96,0,135,0],[44,0,44,2],[91,0,91,2],[49,0,88,0]]}
["Year 1",null,null,null,"UQ Contributions",null,null,null,"Key Industry Partner",null,"Other Industry Partners",null,"Total (red highlight - salary gap; yellow highlight - overspend) ","UQ cash total","Industry Parters cash totals","Industry Parters in-kind totals",null,null,null,null,null,null,null,null,null,null,null,"Stop Insert/Delete"]
[null,null,null,"Australian Research Council","UQ Graduate School Stipend (cash)","UQ Central Support (cash)","UQ Local Sources (cash)","In-kind","Cash","In-kind","Cash","In-kind",null,null,null,null,null,null,"RMS Data Entry",null,null,null,null,null,null,null,null,{"$f":"1","v":1}]
["Year 1",null,"Fellow salary",112897,null,null,null,null,null,null,null,null,null,null,null,null,null,null,"YEAR 1",null,null,null,null,null,null,null,null,1]
[null,null,"Project costs",50000,{"$f":"_xlfn.XLOOKUP($C$5,List!$B$3:$B$5,List!$C$3:$C$5,0)","v":32192},null,null,null,null,null,null,null,null,null,null,null,null,null,null,"ARC","Administering Organisation",null,"Key Industry Partner",null,"Other Industry Partners",null,null,1]
[null,"Duration of Fellowship","3 Years",null,null,null,null,null,null,null,null,null,"Fellow salary",null,null,null,"Salary Gap",null,null,"Cash","Cash","In-kind","Cash","In-kind","Cash","In-kind",null,1]
[null,"Fellow [INSER YOUR NAME]","D02",{"$f":"D3","v":112897},null,null,null,null,null,null,null,null,{"$f":"(D6+G6+I6+K6)","v":112897},{"$f":"ROUNDUP(_xlfn.XLOOKUP(C6,'Salary Gap Calculations'!C7:C25,'Salary Gap Calculations'!D7:D25, \"Check Salary Code\"),0)","v":222524},null,null,{"$f":"M6-N6","v":-109627},null,"Personnel",{"$f":"D3","v":112897},{"$f":"E6+F6+G6","v":0},"-",{"$f":"I6","v":0},"-",{"$f":"K53","v":0},"-",null,1]
[null,"Personnel Other",null,null,null,null,null,null,null,null,null,null,"Project costs",null,null,null,null,null,"Project costs",{"$f":"D4","v":50000},{"$f":"E44+F44+G44","v":32192},{"$f":"H44","v":0},{"$f":"I44","v":0},{"$f":"J44","v":0},{"$f":"K91","v":0},{"$f":"L44","v":0},null,1]
[null,{"$f":"_xlfn.XLOOKUP(E4,List!$C$3:$C$5,List!$D$3:$D$5)","v":"Earmarked PhD Stipend"},null,null,{"$f":"_xlfn.XLOOKUP(B8,List!$D$3:$D$5,List!$C$3:$C$5,\"0\")","v":32192},null,null,null,null,null,null,null,{"$f":"SUM(D8:L8)","v":32192},{"$f":"E8+F8+G8","v":32192},{"$f":"I8+K8","v":0},{"$f":"J8+L8","v":0},null,null,"YEAR 2",null,null,null,null,null,null,null,null,1]
[null,"Format: Research Position (eg. Postdoctoal Research Associate), Appointment Level (A-E), FTE, incl. 30% Oncosts",null,null,null,null,null,null,null,null,null,null,{"$f":"SUM(D9:L9)","v":0},0,{"$f":"I9+K9","v":0},{"$f":"J9+L9","v":0},null,null,null,"ARC","Administering Organisation",null,"Key Industry Partner",null,"Other Industry Partners",null,null,1]
[null,"Format: Professional Staffer (eg. Research Assistant), Appointment Level (HEW), FTE or Hours, incl. 30% Oncosts",null,null,null,null,null,null,null,null,null,null,0,0,0,0,null,null,null,"Cash","Cash","In-kind","Cash","In-kind","Cash","In-kind",null,1]
[null,null,null,null,null,null,null,null,null,null,null,null,0,0,0,0,null,null,"Personnel",{"$f":"D50","v":112897},{"$f":"F53+G53","v":0},"-",{"$f":"I53","v":0},"-",null,"-",null,1]
[null,null,null,null,null,null,null,null,null,null,null,null,0,0,0,0,null,null,"Project costs",{"$f":"D51","v":50000},{"$f":"E91+F91+G91","v":32192},{"$f":"H91","v":0},{"$f":"I91","v":0},{"$f":"J91","v":0},{"$f":"K91","v":0},{"$f":"L91","v":0},null,1]
[null,null,null,null,null,null,null,null,null,null,null,null,0,0,0,0,null,null,"YEAR 3",null,null,null,null,null,null,null,null,1]
[null,null,null,null,null,null,null,null,null,null,null,null,0,0,0,0,null,null,null,"ARC","Administering Organisation",null,"Key Industry Partner",null,"Other Industry Partners",null,null,1]
[null,null,null,null,null,null,null,null,null,null,null,null,0,0,0,0,null,null,null,"Cash","Cash","In-kind","Cash","In-kind","Cash","In-kind",null,1]
{"$rows_left_out":125}
{"sheet":"F2_ARC Contributions","index":3,"n_rows":139,"n_cols":5,"rows_kept":139,"cut":false,"hidden":false,"merged":[[0,0,1,2],[46,0,47,2],[93,0,94,2]]}
["Year 1"]
[]
["Description","Cost ","Justification ",null,"CLICK CTRL+SHIFT+H TO RUN MACROS BEFORE EXPORTING"]
[{"$f":"'IE24 BUDGET tool'!B6","v":"Fellow [INSER YOUR NAME]"},{"$f":"'IE24 BUDGET tool'!D3","v":112897}]
["Personnel Other","Total:",{"$f":"SUM(B6:B13)","v":1E-3}]
[{"$f":"'IE24 BUDGET tool'!B8","v":"Earmarked PhD Stipend"},{"$f":"'IE24 BUDGET tool'!D8","v":0},"Justification should explain both the cost and the need for the project. "]
[{"$f":"'IE24 BUDGET tool'!B9","v":"Format: Research Position (eg. Postdoctoal Research Associate), Appointment Level (A-E), FTE, incl. 30% Oncosts"},{"$f":"'IE24 BUDGET tool'!D9","v":0},"Justification should explain both the cost and the need for the project. ",null,"NAVIGATION:"]
[{"$f":"'IE24 BUDGET tool'!B10","v":"Format: Professional Staffer (eg. Research Assistant), Appointment Level (HEW), FTE or Hours, incl. 30% Oncosts"},{"$f":"'IE24 BUDGET tool'!D10","v":0},null,null,"Year 1"]
[{"$f":"'IE24 BUDGET tool'!B11","v":0},{"$f":"'IE24 BUDGET tool'!D11","v":0},null,null,"Year 2"]
[{"$f":"'IE24 BUDGET tool'!B12","v":0},{"$f":"'IE24 BUDGET tool'!D12","v":0},null,null,"Year 3"]
[{"$f":"'IE24 BUDGET tool'!B13","v":0},{"$f":"'IE24 BUDGET tool'!D13","v":0}]
[{"$f":"'IE24 BUDGET tool'!B14","v":0},{"$f":"'IE24 BUDGET tool'!D14","v":0}]
["N/A",1E-3]
["Travel","Total:",{"$f":"B15+B16+B17+B18+B19","v":0}]
[{"$f":"'IE24 BUDGET tool'!B17","v":"Format: Conference Name and number of people attending if applicable (flights, accom, daily allowance...) number of days"},{"$f":"'IE24 BUDGET tool'!D17","v":0}]
{"$rows_left_out":125}
{"sheet":"F3_Non-ARC Contributions","index":4,"n_rows":326,"n_cols":5,"rows_kept":326,"cut":false,"hidden":false,"merged":[[0,0,1,2],[109,0,110,2],[218,0,219,2]]}
["Year 1"]
[]
["Description","Cost ","Justification ",null,"CLICK CTRL+SHIFT+H TO RUN THE ALGORITHM BEFORE EXPORTING"]
[{"$f":"'IE24 BUDGET tool'!B6","v":"Fellow [INSER YOUR NAME]"}]
["UQ",{"$f":"'IE24 BUDGET tool'!F6+'IE24 BUDGET tool'!G6","v":0}]
["Industry Partner",{"$f":"'IE24 BUDGET tool'!I6+'IE24 BUDGET tool'!K6","v":0}]
["Personnel Other"]
["UQ"]
["Cash","Total:",{"$f":"SUM(B10:B13)","v":32192},null,"NAVIGATION:"]
[{"$f":"'IE24 BUDGET tool'!B8","v":"Earmarked PhD Stipend"},{"$f":"'IE24 BUDGET tool'!N8","v":32192},null,null,"Year 1"]
[{"$f":"'IE24 BUDGET tool'!B9","v":"Format: Research Position (eg. Postdoctoal Research Associate), Appointment Level (A-E), FTE, incl. 30% Oncosts"},{"$f":"'IE24 BUDGET tool'!N9","v":0},null,null,"Year 2"]
[{"$f":"'IE24 BUDGET tool'!B10","v":"Format: Professional Staffer (eg. Research Assistant), Appointment Level (HEW), FTE or Hours, incl. 30% Oncosts"},{"$f":"'IE24 BUDGET tool'!N10","v":0},null,null,"Year 3"]
[{"$f":"'IE24 BUDGET tool'!B11","v":0},{"$f":"'IE24 BUDGET tool'!N11","v":0}]
["N/A",1E-3]
["In-kind","Total:",{"$f":"SUM(B16:B21)","v":1E-3}]
{"$rows_left_out":312}
{"sheet":"UQ Research Academic Staff","index":5,"n_rows":33,"n_cols":6,"rows_kept":33,"cut":false,"hidden":false,"merged":[[9,2,12,2],[13,2,18,2],[19,3,24,3],[25,3,27,3],[5,1,5,4],[13,1,18,1],[19,1,24,1],[25,1,32,1],[9,1,12,1]]}
[]
[null,null,null,"FTE Fraction",1]
[]
[null,"The University of Queensland - Research Academic Staff Salaries "]
[]
[]
[null,"LEVEL","CLASSIFICATION",null,"Salary\nLevel","Indicative 2024 Fraction FTE, including 30% On-Costs"]
["HDR Stipend","HDR Stipend","HDR Student","$32,192 (2023)","HDR"]
["Academic E1","E","Professorial Res. Fellow (U Qld)\nNHMRC Senior Principal Res. Fellow (NHMRC)",null,"01",{"$f":"VLOOKUP(A9,'Admin-Salaries'!$A$1:$B$60,2,FALSE)*SalaryOncostsMultiplier*$E$2","v":277243.71664162667}]
["Academic D4","D","All the classifications in the following group can be appointed to any level of the adjacent salary range.\n\nPrincipal Res. Fellow (U Qld)\nNHMRC Principal Res. Fellow (NHMRC)",null,"04",{"$f":"VLOOKUP(A10,'Admin-Salaries'!$A$1:$B$60,2,FALSE)*SalaryOncostsMultiplier*$E$2","v":237116.33889346011}]
["Academic D3",null,null,null,"03",{"$f":"VLOOKUP(A11,'Admin-Salaries'!$A$1:$B$60,2,FALSE)*SalaryOncostsMultiplier*$E$2","v":229820.56288294159}]
["Academic D2",null,null,null,"02",{"$f":"VLOOKUP(A12,'Admin-Salaries'!$A$1:$B$60,2,FALSE)*SalaryOncostsMultiplier*$E$2","v":222523.91588625926}]
["Academic D1",null,null,null,"01",{"$f":"VLOOKUP(A13,'Admin-Salaries'!$A$1:$B$60,2,FALSE)*SalaryOncostsMultiplier*$E$2","v":215228.17154796488}]
["Academic C6","C","All the classifications in each of the following groups can be appointed to any level of the corresponding salary range.\n\nSenior Res. Fellow (U Qld)\nNHMRC Senior Res. Fellow (NHMRC)",null,"06",{"$f":"VLOOKUP(A14,'Admin-Salaries'!$A$1:$B$60,2,FALSE)*SalaryOncostsMultiplier*$E$2","v":206108.43965773267}]
["Academic C5",null,null,null,"05",{"$f":"VLOOKUP(A15,'Admin-Salaries'!$A$1:$B$60,2,FALSE)*SalaryOncostsMultiplier*$E$2","v":200637.52218531576}]
{"$rows_left_out":19}
{"sheet":"UQ Professional Staff","index":6,"n_rows":42,"n_cols":7,"rows_kept":42,"cut":false,"hidden":false,"merged":[[7,3,7,4],[7,5,7,6]]}
[]
[null,null,null,null,null,"FTE Fraction (rate per annum); OR",1]
[null,null,null,null,null,"Number of Hours (casual)",1]
[]
[]
[null,null,null,"The University of Queensland - Professional Staff Salaries"]
[]
[null,null,null,null,null,"Indicative 2024 Fraction FTE Including 30% On-Costs"]
[null,null,null,"HEW Level","Salary Point","Rate per Annum, including 30% On-Costs","Total Cost of Casual by Number of Hours"]
["HEW 1 1",null,null,"Level 1","01",{"$f":"VLOOKUP(A10,'Admin-Salaries'!$A$1:$B$60,2,FALSE)*SalaryOncostsMultiplier*$G$2","v":76356.512629675737},{"$f":"VLOOKUP(A10,'Admin-Salaries'!$A$1:$B$60,2,FALSE)*CasualLoadingMultiplier*SalaryOncostsCasualMultiplier/'Admin-Other'!$B$22*CASUALHOURS","v":50.46097814289287}]
["HEW 1 2",null,null,null,"02",{"$f":"VLOOKUP(A11,'Admin-Salaries'!$A$1:$B$60,2,FALSE)*SalaryOncostsMultiplier*$G$2","v":77933.298057497246},{"$f":"VLOOKUP(A11,'Admin-Salaries'!$A$1:$B$60,2,FALSE)*CasualLoadingMultiplier*SalaryOncostsCasualMultiplier/'Admin-Other'!$B$22*CASUALHOURS","v":51.503012833440145}]
["HEW 1 3",null,null,null,"03",{"$f":"VLOOKUP(A12,'Admin-Salaries'!$A$1:$B$60,2,FALSE)*SalaryOncostsMultiplier*$G$2","v":79504.552775971955},{"$f":"VLOOKUP(A12,'Admin-Salaries'!$A$1:$B$60,2,FALSE)*CasualLoadingMultiplier*SalaryOncostsCasualMultiplier/'Admin-Other'!$B$22*CASUALHOURS","v":52.54139249845192}]
["HEW 2 1",null,null,"Level 2","01",{"$f":"VLOOKUP(A13,'Admin-Salaries'!$A$1:$B$60,2,FALSE)*SalaryOncostsMultiplier*$G$2","v":81497.207932775869},{"$f":"VLOOKUP(A13,'Admin-Salaries'!$A$1:$B$60,2,FALSE)*CasualLoadingMultiplier*SalaryOncostsCasualMultiplier/'Admin-Other'!$B$22*CASUALHOURS","v":53.858258930022359}]
["HEW 2 2",null,null,null,"02",{"$f":"VLOOKUP(A14,'Admin-Salaries'!$A$1:$B$60,2,FALSE)*SalaryOncostsMultiplier*$G$2","v":83455.749430550946},{"$f":"VLOOKUP(A14,'Admin-Salaries'!$A$1:$B$60,2,FALSE)*CasualLoadingMultiplier*SalaryOncostsCasualMultiplier/'Admin-Other'!$B$22*CASUALHOURS","v":55.152581002986793}]
["HEW 3 1",null,null,"Level 3","01",{"$f":"VLOOKUP(A15,'Admin-Salaries'!$A$1:$B$60,2,FALSE)*SalaryOncostsMultiplier*$G$2","v":85029.731413414309},{"$f":"VLOOKUP(A15,'Admin-Salaries'!$A$1:$B$60,2,FALSE)*CasualLoadingMultiplier*SalaryOncostsCasualMultiplier/'Admin-Other'!$B$22*CASUALHOURS","v":56.192763008414147}]
{"$rows_left_out":28}
{"sheet":"Salary Gap Calculations","index":7,"n_rows":25,"n_cols":6,"rows_kept":25,"cut":false,"hidden":false,"merged":[[1,2,1,5],[2,2,2,5],[3,2,3,5]]}
[]
[null,null,"ARC Industry Fellowships 2024 Salary Gap Calculations for UQ applicants "]
[null,null,"As the DECRA salary and salary on-costs paid by the ARC are at a fixed rate (and the total is less than UQ academic appointment levels), there will be a gap between this and your actual UQ salary. This is to be outlined as a cash commitment in Parts D2, E1 and E3 of the Application, as required by ARC. \n \nThe level of academic appointment nominated on the signed Application Certification Form will determine the salary gap calculated the Application budget, incremented yearly across the life of the three year award. For example, approximate figures would be calculated as follows:  \n"]
[null,null,"• A level B01 would have $32,589 in year 1 of the budget as a UQ cash contribution, incrementing to B02 ($37,902) and B03 ($43,214) in years 2 and 3 respectively.\n• If the nominated level of appointment is at the top of that pay band (e.g. B06) then you may include that salary level each year, with no increments."]
[]
[null,null,"Level ","Yearly UQ Salary 2024 (including on-costs) ","ARC IE24 salary Level (including on-costs) ","ARC IE24 Yearly salary gap "]
[null,null,"D04",{"$f":"+'UQ Research Academic Staff'!F10","v":237116.33889346011},112897,{"$f":"D7-E7","v":124219.33889346011}]
[null,null,"D03",{"$f":"+'UQ Research Academic Staff'!F11","v":229820.56288294159},112897,{"$f":"D8-E8","v":116923.56288294159}]
[null,null,"D02",{"$f":"+'UQ Research Academic Staff'!F12","v":222523.91588625926},112897,109626.91588625926]
[null,null,"D01",{"$f":"+'UQ Research Academic Staff'!F13","v":215228.17154796488},112897,102331.17154796488]
[null,null,"C06",{"$f":"+'[2]UQ Research Academic Staff'!F14","v":206108.43965773267},112897,{"$f":"+D11-E11","v":93211.43965773267}]
[null,null,"C05",{"$f":"+'[2]UQ Research Academic Staff'!F15","v":200637.52218531576},112897,87740.522185315756]
[null,null,"C04",{"$f":"+'[2]UQ Research Academic Staff'!F16","v":195166.54136845047},112897,82269.541368450475]
[null,null,"C03",{"$f":"+'[2]UQ Research Academic Staff'!F17","v":189692.88424864563},112897,76795.884248645627]
[null,null,"C02",{"$f":"+'[2]UQ Research Academic Staff'!F18","v":184221.95094011666},112897,71324.950940116658]
{"$rows_left_out":11}
{"sheet":"List","index":8,"n_rows":5,"n_cols":4,"rows_kept":5,"cut":false,"hidden":true,"merged":[]}
[]
[null,"Dropdown"]
[null,"1 Year",0,"N/A"]
[null,"2 Years",0,"N/A"]
[null,"3 Years",32192,"Earmarked PhD Stipend"]

{"sheet":"Lists","index":9,"n_rows":20,"n_cols":1,"rows_kept":20,"cut":false,"hidden":true,"merged":[]}
["Academic Level"]
["D04"]
["D03"]
["D02"]
["D01"]
["C06"]
["C05"]
["C04"]
["C03"]
["C02"]
["C01"]
["B06"]
["B05"]
["B04"]
["B03"]
{"$rows_left_out":6}
{"sheet":"Salary Gap Calculations (2)","index":10,"n_rows":25,"n_cols":10,"rows_kept":25,"cut":false,"hidden":true,"merged":[[0,2,0,5],[1,2,1,5],[2,2,2,5]]}
[null,null,"ARC Industry Fellowships 2024 Salary Gap Calculations for UQ applicants "]
[null,null,"As the DECRA salary and salary on-costs paid by the ARC are at a fixed rate (and the total is less than UQ academic appointment levels), there will be a gap between this and your actual UQ salary. This is to be outlined as a cash commitment in Parts D2, E1 and E3 of the Application, as required by ARC. \n \nThe level of academic appointment nominated on the signed Application Certification Form will determine the salary gap calculated the Application budget, incremented yearly across the life of the three year award. For example, approximate figures would be calculated as follows:  \n"]
[null,null,"• A level B01 would have $32,589 in year 1 of the budget as a UQ cash contribution, incrementing to B02 ($37,902) and B03 ($43,214) in years 2 and 3 respectively.\n• If the nominated level of appointment is at the top of that pay band (e.g. B06) then you may include that salary level each year, with no increments."]
[]
[null,null,"Level ","Yearly UQ Salary 2024 (including on-costs) ","ARC IE24 salary Level (including on-costs) ","ARC IE24 Yearly salary gap ","ARC IM24 salary Level (including on-costs) ","ARC IM24 Yearly salary gap ","ARC IL24 salary Level (including on-costs) ","ARC IL24 Yearly salary gap "]
[null,null,"E01",{"$f":"+'UQ Research Academic Staff'!F9","v":277243.71664162667},109079,{"$f":"+D6-E6","v":168164.71664162667},199824,{"$f":"+D6-G6","v":77419.71664162667},173758,{"$f":"+D6-I6","v":103485.71664162667}]
[null,null,"D04",{"$f":"+'UQ Research Academic Staff'!F10","v":237116.33889346011},109079,{"$f":"+D7-E7","v":128037.33889346011},199824,37292.33889346011,173758,{"$f":"+D7-I7","v":63358.33889346011}]
[null,null,"D03",{"$f":"+'UQ Research Academic Staff'!F11","v":229820.56288294159},109079,120741.56288294159,199824,29996.562882941595,173758,{"$f":"+D8-I8","v":56062.562882941595}]
[null,null,"D02",{"$f":"+'UQ Research Academic Staff'!F12","v":222523.91588625926},109079,113444.91588625926,199824,22699.915886259259,173758,48765.915886259259]
[null,null,"D01",{"$f":"+'UQ Research Academic Staff'!F13","v":215228.17154796488},109079,106149.17154796488,199824,15404.171547964885,173758,41470.171547964885]
[null,null,"C06",{"$f":"+'UQ Research Academic Staff'!F14","v":206108.43965773267},109079,97029.43965773267,199824,6284.4396577326697,173758,32350.43965773267]
[null,null,"C05",{"$f":"+'UQ Research Academic Staff'!F15","v":200637.52218531576},109079,91558.522185315756,199824,813.52218531575636,173758,26879.522185315756]
[null,null,"C04",{"$f":"+'UQ Research Academic Staff'!F16","v":195166.54136845047},109079,86087.541368450475,199824,-4657.4586315495253,173758,21408.541368450475]
[null,null,"C03",{"$f":"+'UQ Research Academic Staff'!F17","v":189692.88424864563},109079,80613.884248645627,199824,-10131.115751354373,173758,15934.884248645627]
[null,null,"C02",{"$f":"+'UQ Research Academic Staff'!F18","v":184221.95094011666},109079,75142.950940116658,199824,-15602.049059883342,173758,10463.950940116658]
{"$rows_left_out":11}
{"sheet":"Admin-Salaries","index":11,"n_rows":60,"n_cols":11,"rows_kept":60,"cut":false,"hidden":true,"merged":[[1,6,1,10],[3,6,3,10]]}
["BaseSalary",2024,2025,2026]
["HDR Stipend",33383.103999999999,{"$f":"B2*(100%+3.7%)","v":34618.278847999994},{"$f":"C2*(100%+3.7%)","v":35899.155165375989},null,"RTP website","Refer to the latest HDR Stipend rate from RTP website, use 2% increase for stipend estimate from 2023 onwards"]
["Academic E1",213264.39741663591,{"$f":"B3*(100%+3.7%)","v":221155.18012105141},229337.92178553028]
["Academic D4",182397.18376420008,189145.87956347546,196144.27710732404,null,"Wage Indexation rate in Finance Workbook","Indexation for Calendar Year"]
["Academic D3",176785.04837149353,183326.09516123877,190109.16068220459,null,null,2023,2024,2025,2026,"2027 onwards"]
["Academic D2",171172.2429894302,177505.61598003912,184073.32377130055,null,null,3.5000000000000003E-2,3.6999999999999998E-2,3.6999999999999998E-2,3.6999999999999998E-2,0.02]
["Academic D1",165560.13195997299,171685.85684249198,178038.23354566417]
["Academic C6",158544.95358287127,164411.11686543751,170494.32818945867]
["Academic C5",154336.55552716597,160047.00808167108,165968.74738069289]
["Academic C4",150128.10874496191,155682.84876852549,161443.11417296092]
["Academic C3",145917.60326818895,151316.55458911194,156915.26710890906]
["Academic C2",141709.19303085897,146952.43317300073,152389.67320040174]
["Academic C1",137499.43063319079,142586.90956661882,147862.62522058369]
["Academic B6",133290.36258812869,138222.10600388944,143336.32392603334]
["Academic B5",129081.17272681995,133857.17611771228,138809.89163406764]
{"$rows_left_out":46}
{"sheet":"Admin-Other","index":12,"n_rows":23,"n_cols":10,"rows_kept":23,"cut":false,"hidden":true,"merged":[]}
[]
[]
["Data Entry",null,null,null,null,null,null,"UQ Standard Salary Oncosts"]
["Type","Cost,In Kind Support,Outgoing Payment,Direct Cost w Indirect Cost as In Kind Support"]
["People Categories","Personnel,Personnel - HDR",null,null,null,null,null,"Non-Casual"]
["Other Categories","Consumables,Equipment,Travel - Domestic,Travel - International,Hospitality,Collaborator Payments,Subcontracts,Other",null,null,null,null,null,"Payroll Tax","NonCasualPRT",5.7000000000000002E-2]
["Cash Categories","UQ Central Cash Support,UQ Faculty Cash Support,UQ School Cash Support,Other Cash Support",null,null,null,null,null,"Workers Compensation","NonCasualWC",2E-3]
[null,null,null,null,null,null,null,"Superannuation","NonCasualSuper",0.17]
[null,null,null,null,null,null,null,"PRT on Superannuation","NonCasualPRTSuper",9.6900000000000007E-3]
[null,"Default Overheads",null,"Default Markup",null,null,null,"Long Service Leave","NonCasualLSL",2.4400000000000002E-2]
[null,"Research","Consultancy","Research","Consultancy",null,null,"Recreation Leave","NonCasualRec",1.4999999999999999E-2]
["HDR",null,null,null,null,null,null,"Parental Leave","NonCasualParent",1.0699999999999999E-2]
["Outgoing Payment",0.4,0.4,null,null,null,null,null,null,{"$f":"SUM(J6:J12)","v":0.28878999999999999}]
["Personnel",0.4,0.4,null,0.428571429]
["Else (including In Kind)",0.4,0.4,null,null,null,null,"Casual"]
{"$rows_left_out":8}